Target
Sigma non-opioid intracellular receptor 1
Ligand
BDBM50058008
Substrate
Meas. Tech.
ChEMBL_202076 (CHEMBL811508)
Ki
0.84±n/a nM
Citation
 Waterhouse, RNMardon, KGiles, KMCollier, TLO'Brien, JC Halogenated 4-(phenoxymethyl)piperidines as potential radiolabeled probes for sigma-1 receptors: in vivo evaluation of [123I]-1-(iodopropen-2-yl)-4-[(4-cyanophenoxy)methyl]pip eri dine. J Med Chem 40:1657-67 (1997)  
Target
Name:
Sigma non-opioid intracellular receptor 1
Synonyms:
Opioid receptor SGMR1_RAT Sigma non-opioid intracellular receptor 1 Sigma-1 | Sigmar1
Type:
Enzyme Catalytic Domain
Mol. Mass.:
25266.54
Organism:
RAT
Description:
Q9R0C9
Residue:
223
  
Inhibitor
Name:
BDBM50058008
Synonyms:
1-(2-Fluoro-ethyl)-4-(4-iodo-phenoxymethyl)-piperidine | CHEMBL45168
Type:
Small organic molecule
Emp. Form.:
C14H19FINO
Mol. Mass.:
363.2096
SMILES:
FCCN1CCC(COc2ccc(I)cc2)CC1
: