Target
C-C chemokine receptor type 2
Ligand
BDBM50506124
Substrate
Meas. Tech.
ChEMBL_1824959 (CHEMBL4324723)
EC50
135±n/a nM
Citation
 Ortiz Zacarķas, NVvan Veldhoven, JPDden Hollander, LSDogan, BOpeny, JHsiao, YYLenselink, EBHeitman, LHIJzerman, AP Synthesis and Pharmacological Evaluation of Triazolopyrimidinone Derivatives as Noncompetitive, Intracellular Antagonists for CC Chemokine Receptors 2 and 5. J Med Chem 62:11035-11053 (2019)  
Target
Name:
C-C chemokine receptor type 2
Synonyms:
C-C chemokine receptor type 2 (CCR2) CCR2_HUMAN Chemoattractant Cytokine Receptor 2 (CCR2) Monocyte chemotactic protein-1 (MCP-1)
Type:
Enzyme
Mol. Mass.:
41932.32
Organism:
Homo sapiens (Human)
Description:
P41597
Residue:
374
  
Inhibitor
Name:
BDBM50506124
Synonyms:
CHEMBL4544504
Type:
Small organic molecule
Emp. Form.:
C15H15BrClN5O
Mol. Mass.:
396.67
SMILES:
CC(C)c1[nH]c2nc(N)nn2c(=O)c1Cc1ccc(Cl)c(Br)c1
: