Target
Dimer of Protein farnesyltransferase subunit beta
Ligand
BDBM50058193
Substrate
Meas. Tech.
ChEMBL_70569 (CHEMBL857375)
IC50
80±n/a nM
Citation
 Burns, CJGuitton, JDBaudoin, BLelièvre, YDuchesne, MParker, FFromage, NCommerçon, A Novel conformationally extended naphthalene-based inhibitors of farnesyltransferase. J Med Chem 40:1763-7 (1997)  
Target
Name:
Dimer of Protein farnesyltransferase subunit beta
Synonyms:
Protein Farnesyltransferase (PFT) Chain B
Type:
Mol. Mass.:
Description:
ASSAY_ID of EBI is 51428
Components:
This complex has 3 components.
Component 1
Name:
Protein farnesyltransferase subunit beta
Synonyms:
CAAX farnesyltransferase subunit alpha FNTB FTase-alpha GGTase-I-alpha Protein farnesyl/geranylgeranyl transferase Protein farnesyltransferase subunit beta Protein farnesyltransferase/geranylgeranyltransferase type-1 subunit alpha Ras proteins prenyltransferase subunit beta | Type I protein geranyl-geranyltransferase subunit alpha
Type:
Enzyme Subunit
Mol. Mass.:
48766.02
Organism:
Homo sapiens (Human)
Description:
Protein farnesyltransferase subunit beta
Residue:
437
  
Component 2
Name:
Protein farnesyltransferase subunit beta
Synonyms:
CAAX farnesyltransferase subunit alpha FNTB FTase-alpha GGTase-I-alpha Protein farnesyl/geranylgeranyl transferase Protein farnesyltransferase subunit beta Protein farnesyltransferase/geranylgeranyltransferase type-1 subunit alpha Ras proteins prenyltransferase subunit beta | Type I protein geranyl-geranyltransferase subunit alpha
Type:
Enzyme Subunit
Mol. Mass.:
48766.02
Organism:
Homo sapiens (Human)
Description:
Protein farnesyltransferase subunit beta
Residue:
437
  
Inhibitor
Name:
BDBM50058193
Synonyms:
(S)-2-{[6-((R)-2-Amino-3-mercapto-propylamino)-naphthalene-1-carbonyl]-amino}-4-methylsulfanyl-butyric acid methyl ester RPR-114334
Type:
Small organic molecule
Emp. Form.:
C20H27N3O3S2
Mol. Mass.:
421.577
SMILES:
COC(=O)[C@H](CCSC)NC(=O)c1cccc2cc(NC[C@@H](N)CS)ccc12
: