Target
D(3) dopamine receptor
Ligand
BDBM50058228
Substrate
Meas. Tech.
ChEMBL_62128 (CHEMBL673449)
Ki
1450±n/a nM
Citation
 Glase, SAAkunne, HCGeorgic, LMHeffner, TGMacKenzie, RGManley, PJPugsley, TAWise, LD Substituted [(4-phenylpiperazinyl)-methyl]benzamides: selective dopamine D4 agonists. J Med Chem 40:1771-2 (1997)  
Target
Name:
D(3) dopamine receptor
Synonyms:
DOPAMINE D3 DRD3_HUMAN Dopamine D3 receptor (D3) Dopamine receptor Dopamine receptor D3
Type:
Mol. Mass.:
44243.43
Organism:
Homo sapiens (Human)
Description:
Residue:
400
  
Inhibitor
Name:
BDBM50058228
Synonyms:
3-Chloro-N-[4-(2-methoxy-phenyl)-piperazin-1-ylmethyl]-benzamide | CHEMBL48819
Type:
Small organic molecule
Emp. Form.:
C19H22ClN3O2
Mol. Mass.:
359.85
SMILES:
COc1ccccc1N1CCN(CNC(=O)c2cccc(Cl)c2)CC1
: