Target
D(4) dopamine receptor
Ligand
BDBM50058220
Substrate
Meas. Tech.
ChEMBL_60667 (CHEMBL671703)
Ki
12±n/a nM
Citation
 Glase, SAAkunne, HCGeorgic, LMHeffner, TGMacKenzie, RGManley, PJPugsley, TAWise, LD Substituted [(4-phenylpiperazinyl)-methyl]benzamides: selective dopamine D4 agonists. J Med Chem 40:1771-2 (1997)  
Target
Name:
D(4) dopamine receptor
Synonyms:
D(2C) dopamine receptor DOPAMINE D4.2 DRD4 Dopamine D4 receptor
Type:
Enzyme
Mol. Mass.:
48373.19
Organism:
Homo sapiens (Human)
Description:
P21917
Residue:
419
  
Inhibitor
Name:
BDBM50058220
Synonyms:
CHEMBL51536 | N-[4-(2-Chloro-phenyl)-piperazin-1-ylmethyl]-4-methyl-benzamide
Type:
Small organic molecule
Emp. Form.:
C19H22ClN3O
Mol. Mass.:
343.85
SMILES:
Cc1ccc(cc1)C(=O)NCN1CCN(CC1)c1ccccc1Cl
: