Target
Chymotrypsinogen A
Ligand
BDBM50058966
Substrate
Meas. Tech.
ChEMBL_34106 (CHEMBL649735)
IC50
8000±n/a nM
Citation
 Niwata, SFukami, HSumida, MIto, AKakutani, SSaitoh, MSuzuki, KImoto, MShibata, HImajo, SKiso, YTanaka, TNakazato, HIshihara, TTakai, SYamamoto, DShiota, NMiyazaki, MOkunishi, HKinoshita, AUrata, HArakawa, K Substituted 3-(phenylsulfonyl)-1-phenylimidazolidine-2,4-dione derivatives as novel nonpeptide inhibitors of human heart chymase. J Med Chem 40:2156-63 (1997)  
Target
Name:
Chymotrypsinogen A
Synonyms:
Alpha-chymotrypsin Chymotrypsin A Chymotrypsin A chain B Chymotrypsinogen A | alpha-Chymotrypsin (α-Chymotrypsin)
Type:
Serine protease
Mol. Mass.:
25670.88
Organism:
Bos taurus (bovine)
Description:
Residue:
245
  
Inhibitor
Name:
BDBM50058966
Synonyms:
3-(4-Phenoxy-benzenesulfonyl)-1-phenyl-imidazolidine-2,4-dione | CHEMBL273334
Type:
Small organic molecule
Emp. Form.:
C21H16N2O5S
Mol. Mass.:
408.427
SMILES:
O=C1CN(C(=O)N1S(=O)(=O)c1ccc(Oc2ccccc2)cc1)c1ccccc1
: