Target
Phosphodiesterase
Ligand
BDBM50059057
Substrate
Meas. Tech.
ChEMBL_156454 (CHEMBL764832)
IC50
175000±n/a nM
Citation
 Ahn, HSBercovici, ABoykow, GBronnenkant, AChackalamannil, SChow, JCleven, RCook, JCzarniecki, MDomalski, CFawzi, AGreen, MGündes, AHo, GLaudicina, MLindo, NMa, KManna, MMcKittrick, BMirzai, BNechuta, TNeustadt, BPuchalski, CPula, KZhang, H Potent tetracyclic guanine inhibitors of PDE1 and PDE5 cyclic guanosine monophosphate phosphodiesterases with oral antihypertensive activity. J Med Chem 40:2196-210 (1997)  
Target
Name:
Phosphodiesterase
Synonyms:
Heart phosphodiesterase | Phosphodiesterase 3B
Type:
PROTEIN
Mol. Mass.:
124301.20
Organism:
Bos taurus
Description:
ChEMBL_156453
Residue:
1115
  
Inhibitor
Name:
BDBM50059057
Synonyms:
(6aR,9aS)-5,6a,7,8,9,9a-Hexahydro-2-methyl-5-1-(methylethyl)cyclopent[4,5]imidazo[2,1-b]purin-4(3H)-one | CHEMBL419447
Type:
Small organic molecule
Emp. Form.:
C14H19N5O
Mol. Mass.:
273.3336
SMILES:
CC(C)N1C2=N[C@@H]3CCC[C@@H]3N2c2nc(C)[nH]c2C1=O
: