Target
cGMP-specific 3',5'-cyclic phosphodiesterase
Ligand
BDBM50059052
Substrate
Meas. Tech.
ChEMBL_155185 (CHEMBL761832)
IC50
26±n/a nM
Citation
 Ahn, HSBercovici, ABoykow, GBronnenkant, AChackalamannil, SChow, JCleven, RCook, JCzarniecki, MDomalski, CFawzi, AGreen, MGündes, AHo, GLaudicina, MLindo, NMa, KManna, MMcKittrick, BMirzai, BNechuta, TNeustadt, BPuchalski, CPula, KZhang, H Potent tetracyclic guanine inhibitors of PDE1 and PDE5 cyclic guanosine monophosphate phosphodiesterases with oral antihypertensive activity. J Med Chem 40:2196-210 (1997)  
Target
Name:
cGMP-specific 3',5'-cyclic phosphodiesterase
Synonyms:
PDE5 PDE5A_BOVIN | Phosphodiesterase 5A
Type:
PROTEIN
Mol. Mass.:
98615.45
Organism:
Bos taurus
Description:
ChEMBL_155186
Residue:
865
  
Inhibitor
Name:
BDBM50059052
Synonyms:
5'-Methyl-2'-(cyclopentylmethyl)spiro[cyclopentane-1,7'(8'H)-[3H]imidazo[2,1-b]purin]-4(5'H)-one | CHEMBL305617
Type:
Small organic molecule
Emp. Form.:
C18H27N5O
Mol. Mass.:
329.4399
SMILES:
CN1C2=NC3(CCCC3)CN2C2NC(CC3CCCC3)N=C2C1=O
: