Target
cGMP-specific 3',5'-cyclic phosphodiesterase
Ligand
BDBM50059027
Substrate
Meas. Tech.
ChEMBL_155185 (CHEMBL761832)
IC50
7500±n/a nM
Citation
 Ahn, HSBercovici, ABoykow, GBronnenkant, AChackalamannil, SChow, JCleven, RCook, JCzarniecki, MDomalski, CFawzi, AGreen, MGündes, AHo, GLaudicina, MLindo, NMa, KManna, MMcKittrick, BMirzai, BNechuta, TNeustadt, BPuchalski, CPula, KZhang, H Potent tetracyclic guanine inhibitors of PDE1 and PDE5 cyclic guanosine monophosphate phosphodiesterases with oral antihypertensive activity. J Med Chem 40:2196-210 (1997)  
Target
Name:
cGMP-specific 3',5'-cyclic phosphodiesterase
Synonyms:
PDE5 PDE5A_BOVIN | Phosphodiesterase 5A
Type:
PROTEIN
Mol. Mass.:
98615.45
Organism:
Bos taurus
Description:
ChEMBL_155186
Residue:
865
  
Inhibitor
Name:
BDBM50059027
Synonyms:
(6aR,9aS)-2-[(N,N-Dimethylamino)methyl]-5,6a,7,8,9,9a-hexahydro-5-methylcyclopent[4,5]imidazo[2,1-b]purin-4(3H)-one | CHEMBL308973
Type:
Small organic molecule
Emp. Form.:
C14H20N6O
Mol. Mass.:
288.3482
SMILES:
CN(C)Cc1nc2N3[C@H]4CCC[C@H]4N=C3N(C)C(=O)c2[nH]1
: