Target
Tubulin beta-2B chain
Ligand
BDBM50014846
Substrate
Meas. Tech.
ChEMBL_211874 (CHEMBL819256)
IC50
800±n/a nM
Citation
 Chen, KKuo, SCHsieh, MCMauger, ALin, CMHamel, ELee, KH Antitumor agents. 174. 2',3',4',5,6,7-Substituted 2-phenyl-1,8-naphthyridin-4-ones: their synthesis, cytotoxicity, and inhibition of tubulin polymerization. J Med Chem 40:2266-75 (1997)  
Target
Name:
Tubulin beta-2B chain
Synonyms:
TBB2B_BOVIN Tubulin | Tubulin beta chain
Type:
PROTEIN
Mol. Mass.:
49932.38
Organism:
Bos taurus
Description:
ChEMBL_211651
Residue:
445
  
Inhibitor
Name:
BDBM50014846
Synonyms:
(S)-N-(5,6,7,9-tetrahydro-1,2,3,10-tetramethoxy-9-oxobenzo[a]heptalen-7-yl)acetamide 7alphaH-colchicine COLCHICINE colchicina | colchicinum
Type:
Small organic molecule
Emp. Form.:
C22H25NO6
Mol. Mass.:
399.437
SMILES:
COc1cc2CC[C@H](NC(C)=O)c3cc(=O)c(OC)ccc3-c2c(OC)c1OC
: