Target
Cathepsin G
Ligand
BDBM50506770
Substrate
Meas. Tech.
ChEMBL_1827395 (CHEMBL4327269)
Ki
38±n/a nM
Citation
 Makar, SSaha, TSingh, SK Naphthalene, a versatile platform in medicinal chemistry: Sky-high perspective. Eur J Med Chem 161:252-276 (2019)  
Target
Name:
Cathepsin G
Synonyms:
CATG_HUMAN CTSG
Type:
PROTEIN
Mol. Mass.:
28860.08
Organism:
Homo sapiens (Human)
Description:
ChEMBL_1469016
Residue:
255
  
Inhibitor
Name:
BDBM50506770
Synonyms:
CHEMBL4472052
Type:
Small organic molecule
Emp. Form.:
C40H35N2O6P
Mol. Mass.:
670.6895
SMILES:
CN(C1CCN(CC1)C(=O)c1ccc2ccccc2c1)C(=O)c1c(ccc2ccccc12)C(=O)C(c1cccc2ccccc12)P(O)(O)=O
: