Target
D(4) dopamine receptor
Ligand
BDBM50059219
Substrate
Meas. Tech.
ChEMBL_60829 (CHEMBL675818)
Ki
3.1±n/a nM
Citation
 Rowley, MCollins, IBroughton, HBDavey, WBBaker, REmms, FMarwood, RPatel, SPatel, SRagan, CIFreedman, SBBall, RLeeson, PD 4-Heterocyclylpiperidines as selective high-affinity ligands at the human dopamine D4 receptor. J Med Chem 40:2374-85 (1997)  
Target
Name:
D(4) dopamine receptor
Synonyms:
D(2C) dopamine receptor DOPAMINE D4.2 DRD4 Dopamine D4 receptor
Type:
Enzyme
Mol. Mass.:
48373.19
Organism:
Homo sapiens (Human)
Description:
P21917
Residue:
419
  
Inhibitor
Name:
BDBM50059219
Synonyms:
4-(4-Methyl-5-phenyl-1H-pyrazol-3-yl)-1-phenethyl-1,2,3,6-tetrahydro-pyridine | CHEMBL80318
Type:
Small organic molecule
Emp. Form.:
C23H25N3
Mol. Mass.:
343.4647
SMILES:
Cc1c(n[nH]c1C1=CCN(CCc2ccccc2)CC1)-c1ccccc1
: