Target
Cytosolic phospholipase A2
Ligand
BDBM50059523
Substrate
Meas. Tech.
ChEMBL_156041 (CHEMBL764349)
IC50
11000±n/a nM
Citation
 Lehr, M Synthesis, biological evaluation, and structure-activity relationships of 3-acylindole-2-carboxylic acids as inhibitors of the cytosolic phospholipase A2. J Med Chem 40:2694-705 (1997)  
Target
Name:
Cytosolic phospholipase A2
Synonyms:
1-alkyl-2-acetylglycerophosphocholine esterase CPLA2 Lysophospholipase PAF 2-acylhydrolase PLA2G4 Phosphatidylcholine 2-acylhydrolase Platelet-activating factor acetylhydrolase
Type:
PROTEIN
Mol. Mass.:
85334.67
Organism:
Bos taurus
Description:
ChEMBL_156041
Residue:
749
  
Inhibitor
Name:
BDBM50059523
Synonyms:
(6Z,9Z,12Z,15Z)-1,1,1-trifluorohenicosa-6,9,12,15-tetraen-2-one Arachidonic acid trifluoromethyl ketone Arachidonyltrifluoromethane | CHEMBL281211
Type:
Small organic molecule
Emp. Form.:
C21H31F3O
Mol. Mass.:
356.4654
SMILES:
CCCCC\C=C/C\C=C/C\C=C/C\C=C/CCCC(=O)C(F)(F)F
: