Target
Cytosolic phospholipase A2
Ligand
BDBM50059535
Substrate
Meas. Tech.
ChEMBL_156041 (CHEMBL764349)
IC50
1900±n/a nM
Citation
 Lehr, M Synthesis, biological evaluation, and structure-activity relationships of 3-acylindole-2-carboxylic acids as inhibitors of the cytosolic phospholipase A2. J Med Chem 40:2694-705 (1997)  
Target
Name:
Cytosolic phospholipase A2
Synonyms:
1-alkyl-2-acetylglycerophosphocholine esterase CPLA2 Lysophospholipase PAF 2-acylhydrolase PLA2G4 Phosphatidylcholine 2-acylhydrolase Platelet-activating factor acetylhydrolase
Type:
PROTEIN
Mol. Mass.:
85334.67
Organism:
Bos taurus
Description:
ChEMBL_156041
Residue:
749
  
Inhibitor
Name:
BDBM50059535
Synonyms:
1-[2-(3-Carboxy-phenoxy)-ethyl]-3-dodecanoyl-1H-indole-2-carboxylic acid | CHEMBL90297
Type:
Small organic molecule
Emp. Form.:
C30H37NO6
Mol. Mass.:
507.6179
SMILES:
CCCCCCCCCCCC(=O)c1c(C(O)=O)n(CCOc2cccc(c2)C(O)=O)c2ccccc12
: