Target
5-lipoxygenase
Ligand
BDBM50059619
Substrate
Meas. Tech.
ChEMBL_157767 (CHEMBL767670)
IC50
2000±n/a nM
Citation
 Müller, KPrinz, H Antipsoriatic anthrones with modulated redox properties. 4. Synthesis and biological activity of novel 9,10-dihydro-1,8-dihydroxy-9-oxo-2-anthracenecarboxylic and -hydroxamic acids. J Med Chem 40:2780-7 (1997)  
Target
Name:
5-lipoxygenase
Synonyms:
Arachidonate 5-lipoxygenase
Type:
PROTEIN
Mol. Mass.:
49994.23
Organism:
Bos taurus
Description:
ChEMBL_157766
Residue:
430
  
Inhibitor
Name:
BDBM50059619
Synonyms:
2-(1,8-Dihydroxy-9-oxo-9,10-dihydro-anthracen-2-yl)-3-methyl-butyric acid | CHEMBL96663
Type:
Small organic molecule
Emp. Form.:
C19H18O5
Mol. Mass.:
326.3432
SMILES:
CC(C)C(C(O)=O)c1ccc2Cc3cccc(O)c3C(=O)c2c1O
: