Target
5-lipoxygenase
Ligand
BDBM50059627
Substrate
Meas. Tech.
ChEMBL_157767 (CHEMBL767670)
IC50
1000±n/a nM
Citation
 Müller, KPrinz, H Antipsoriatic anthrones with modulated redox properties. 4. Synthesis and biological activity of novel 9,10-dihydro-1,8-dihydroxy-9-oxo-2-anthracenecarboxylic and -hydroxamic acids. J Med Chem 40:2780-7 (1997)  
Target
Name:
5-lipoxygenase
Synonyms:
Arachidonate 5-lipoxygenase
Type:
PROTEIN
Mol. Mass.:
49994.23
Organism:
Bos taurus
Description:
ChEMBL_157766
Residue:
430
  
Inhibitor
Name:
BDBM50059627
Synonyms:
2-(1,8-Dihydroxy-9-oxo-9,10-dihydro-anthracen-2-yl)-N-hydroxy-N-methyl-acetamide | CHEMBL96307
Type:
Small organic molecule
Emp. Form.:
C17H15NO5
Mol. Mass.:
313.3047
SMILES:
CN(O)C(=O)Cc1ccc2Cc3cccc(O)c3C(=O)c2c1O
: