Target
Metabotropic glutamate receptor 1
Ligand
BDBM50060136
Substrate
Meas. Tech.
ChEMBL_105574 (CHEMBL709771)
EC50
127000±n/a nM
Citation
 Acher, FCTellier, FJAzerad, RBrabet, INFagni, LPin, JP Synthesis and pharmacological characterization of aminocyclopentanetricarboxylic acids: new tools to discriminate between metabotropic glutamate receptor subtypes. J Med Chem 40:3119-29 (1997)  
Target
Name:
Metabotropic glutamate receptor 1
Synonyms:
GPRC1A GRM1_HUMAN Metabotropic Glutamate 1a | metabotropic glutamate 1
Type:
Enzyme
Mol. Mass.:
132358.19
Organism:
Homo sapiens (Human)
Description:
Q13255
Residue:
1194
  
Inhibitor
Name:
BDBM50060136
Synonyms:
(1R,3S)-1-Amino-cyclopentane-1,3-dicarboxylic acid 1-Amino-cyclopentane-1,3-dicarboxylic acid(trans-ACPD) | CHEMBL36988
Type:
Small organic molecule
Emp. Form.:
C7H11NO4
Mol. Mass.:
173.1665
SMILES:
N[C@@]1(CC[C@@H](C1)C(O)=O)C(O)=O
: