Target
Cytosolic phospholipase A2
Ligand
BDBM50060282
Substrate
Meas. Tech.
ChEMBL_52407 (CHEMBL665910)
IC50
>10000±n/a nM
Citation
 Lehr, M Structure-activity relationships of (4-acylpyrrol-2-yl)alkanoic acids as inhibitors of the cytosolic phospholipase A2: variation of the substituents in positions 1, 3, and 5. J Med Chem 40:3381-92 (1997)  
Target
Name:
Cytosolic phospholipase A2
Synonyms:
1-alkyl-2-acetylglycerophosphocholine esterase CPLA2 Lysophospholipase PAF 2-acylhydrolase PLA2G4 Phosphatidylcholine 2-acylhydrolase Platelet-activating factor acetylhydrolase
Type:
PROTEIN
Mol. Mass.:
85334.67
Organism:
Bos taurus
Description:
ChEMBL_156041
Residue:
749
  
Inhibitor
Name:
BDBM50060282
Synonyms:
(1-Hexyl-3,5-dimethyl-4-octadecanoyl-1H-pyrrol-2-yl)-acetic acid | CHEMBL116561
Type:
Small organic molecule
Emp. Form.:
C32H57NO3
Mol. Mass.:
503.7999
SMILES:
CCCCCCCCCCCCCCCCCC(=O)c1c(C)c(CC(O)=O)n(CCCCCC)c1C
: