Target
Neutrophil elastase
Ligand
BDBM50060353
Substrate
Meas. Tech.
ChEMBL_63661 (CHEMBL675717)
IC50
5400000±n/a nM
Citation
 Buynak, JDRao, ASFord, GPCarver, CAdam, GGeng, BBachmann, BShobassy, SLackey, S 7-alkylidenecephalosporin esters as inhibitors of human leukocyte elastase. J Med Chem 40:3423-33 (1997)  
Target
Name:
Neutrophil elastase
Synonyms:
Bone marrow serine protease Coagulation factor X ELANE Elastase HLE Leukocyte elastase Medullasin Neutrophil elastase (HNE) PMN elastase Trypsin
Type:
Enzyme
Mol. Mass.:
28532.38
Organism:
Homo sapiens (Human)
Description:
P08246
Residue:
267
  
Inhibitor
Name:
BDBM50060353
Synonyms:
3-Acetoxymethyl-7-bromovinylidene-8-oxo-5-thia-1-aza-bicyclo[4.2.0]oct-2-ene-2-carboxylic acid benzhydryl ester | CHEMBL116898
Type:
Small organic molecule
Emp. Form.:
C25H20BrNO5S
Mol. Mass.:
526.399
SMILES:
CC(=O)OCC1=C(N2C(SC1)C(=C=CBr)C2=O)C(=O)OC(c1ccccc1)c1ccccc1
: