Target
Chymotrypsin-like elastase family member 2A
Ligand
BDBM50060369
Substrate
Meas. Tech.
ChEMBL_156952 (CHEMBL762662)
IC50
4800000±n/a nM
Citation
 Buynak, JDRao, ASFord, GPCarver, CAdam, GGeng, BBachmann, BShobassy, SLackey, S 7-alkylidenecephalosporin esters as inhibitors of human leukocyte elastase. J Med Chem 40:3423-33 (1997)  
Target
Name:
Chymotrypsin-like elastase family member 2A
Synonyms:
CEL2A_PIG ELA2 Elastase 2A Elastase-2A | Pancreatic elastase
Type:
PROTEIN
Mol. Mass.:
28705.23
Organism:
Sus scrofa
Description:
ChEMBL_156951
Residue:
269
  
Inhibitor
Name:
BDBM50060369
Synonyms:
3-Acetoxymethyl-7-dibromomethylene-5,5,8-trioxo-5lambda*6*-thia-1-aza-bicyclo[4.2.0]oct-2-ene-2-carboxylic acid benzhydryl ester | CHEMBL334282
Type:
Small organic molecule
Emp. Form.:
C24H19Br2NO7S
Mol. Mass.:
625.283
SMILES:
[#6]-[#6](=O)-[#8]-[#6]-[#6]-1=[#6](-[#7]-2-[#6](\[#6](=[#6](\Br)Br)-[#6]-2=O)S(=O)(=O)[#6]-1)-[#6](=O)-[#8]-[#6](-c1ccccc1)-c1ccccc1
: