Target
Thromboxane-A synthase
Ligand
BDBM50000317
Substrate
Meas. Tech.
ChEMBL_207780 (CHEMBL880940)
IC50
28±n/a nM
Citation
 Dickinson, RPDack, KNLong, CJSteele, J Thromboxane modulating agents. 3. 1H-imidazol-1-ylalkyl- and 3-pyridinylalkyl-substituted 3-[2-[(arylsulfonyl)amino]ethyl]benzenepropanoic acid derivatives as dual thromboxane synthase inhibitor/thromboxane receptor antagonists. J Med Chem 40:3442-52 (1997)  
Target
Name:
Thromboxane-A synthase
Synonyms:
CYP5 Cytochrome P450 5A1 TBXAS1 TXA synthase TXS Thromboxane A2 Synthase (P450 TxA2) Thromboxane prostanoid Thromboxane-A synthase
Type:
Enzyme
Mol. Mass.:
60524.67
Organism:
Homo sapiens (Human)
Description:
P24557
Residue:
533
  
Inhibitor
Name:
BDBM50000317
Synonyms:
3-(3-Imidazol-1-ylmethyl-2-methyl-indol-1-yl)-propionic acid CHEMBL283656 UK-38485
Type:
Small organic molecule
Emp. Form.:
C16H17N3O2
Mol. Mass.:
283.3251
SMILES:
Cc1c(Cn2ccnc2)c2ccccc2n1CCC(O)=O
: