Target
5-hydroxytryptamine receptor 1B
Ligand
BDBM50060441
Substrate
Meas. Tech.
ChEMBL_1611 (CHEMBL616636)
IC50
310±n/a nM
Citation
 MacLeod, AMStreet, LJReeve, AJJelley, RASternfeld, FBeer, MSStanton, JAWatt, APRathbone, DMatassa, VG Selective, orally active 5-HT1D receptor agonists as potential antimigraine agents. J Med Chem 40:3501-3 (1997)  
Target
Name:
5-hydroxytryptamine receptor 1B
Synonyms:
5-HT-1B 5-HT1B 5HT1B_HUMAN HTR1DB Serotonin (5-HT) receptor Serotonin Receptor 1B
Type:
G Protein-Coupled Receptor (GPCR)
Mol. Mass.:
43579.17
Organism:
Homo sapiens (Human)
Description:
Receptor binding assays were performed using human clone stably expressed in CHO cells
Residue:
390
  
Inhibitor
Name:
BDBM50060441
Synonyms:
3-[2-(4-Methyl-piperazin-1-yl)-ethyl]-5-[1,2,4]triazol-4-yl-1H-indole | CHEMBL324931
Type:
Small organic molecule
Emp. Form.:
C17H22N6
Mol. Mass.:
310.3968
SMILES:
CN1CCN(CCc2c[nH]c3ccc(cc23)-n2cnnc2)CC1
: