Target
Glutamate receptor ionotropic, NMDA 1
Ligand
BDBM50060699
Substrate
Meas. Tech.
ChEMBL_140845 (CHEMBL752329)
IC50
690.0±n/a nM
Citation
 Cai, SXHuang, JCEspitia, SATran, MIlyin, VIHawkinson, JEWoodward, RMWeber, EKeana, JF 5-(N-oxyaza)-7-substituted-1,4-dihydroquinoxaline-2,3-diones: novel, systemically active and broad spectrum antagonists for NMDA/glycine, AMPA, and kainate receptors. J Med Chem 40:3679-86 (1997)  
Target
Name:
Glutamate receptor ionotropic, NMDA 1
Synonyms:
Glutamate (NMDA) receptor subunit zeta 1 Glutamate-NMDA-Channel Glutamate-NMDA-Polyamine NMDA Nmdar1 | phencyclidine
Type:
Enzyme Catalytic Domain
Mol. Mass.:
105533.40
Organism:
RAT
Description:
P35439
Residue:
938
  
Inhibitor
Name:
BDBM50060699
Synonyms:
7-Nitro-5-oxy-1,4-dihydro-pyrido[2,3-b]pyrazine-2,3-dione | CHEMBL123196
Type:
Small organic molecule
Emp. Form.:
C7H4N4O5
Mol. Mass.:
224.1305
SMILES:
[O-][N+](=O)c1c[n+]([O-])c2[n-]c(=[OH+])c(=[OH+])[n-]c2c1
: