Target
Neuropeptide Y receptor type 5
Ligand
BDBM50060726
Substrate
Meas. Tech.
ChEMBL_144126 (CHEMBL750099)
Ki
>10000±n/a nM
Citation
 Hipskind, PALobb, KLNixon, JABritton, TCBruns, RFCatlow, JDieckman-McGinty, DKGackenheimer, SLGitter, BDIyengar, SSchober, DASimmons, RMSwanson, SZarrinmayeh, HZimmerman, DMGehlert, DR Potent and selective 1,2,3-trisubstituted indole NPY Y-1 antagonists. J Med Chem 40:3712-4 (1997)  
Target
Name:
Neuropeptide Y receptor type 5
Synonyms:
NPY-Y5 NPY5-R NPY5R_HUMAN NPYY5 Neuropeptide Y receptor type 5 ( NPY Y5) | Y5 receptor
Type:
Enzyme
Mol. Mass.:
50746.64
Organism:
Homo sapiens (Human)
Description:
Q15761
Residue:
445
  
Inhibitor
Name:
BDBM50060726
Synonyms:
2-[1,4']Bipiperidinyl-1'-yl-1-[2-(4-chloro-phenoxymethyl)-1-((R)-3-piperidin-3-yl-propyl)-1H-indol-3-yl]-ethanone | CHEMBL331937
Type:
Small organic molecule
Emp. Form.:
C35H47ClN4O2
Mol. Mass.:
591.226
SMILES:
Clc1ccc(OCc2c(C(=O)CN3CCC(CC3)N3CCCCC3)c3ccccc3n2CCC[C@H]2CCCNC2)cc1
: