Target
Neuropeptide Y receptor type 2
Ligand
BDBM50060727
Substrate
Meas. Tech.
ChEMBL_143849 (CHEMBL747206)
Ki
>10000±n/a nM
Citation
 Hipskind, PALobb, KLNixon, JABritton, TCBruns, RFCatlow, JDieckman-McGinty, DKGackenheimer, SLGitter, BDIyengar, SSchober, DASimmons, RMSwanson, SZarrinmayeh, HZimmerman, DMGehlert, DR Potent and selective 1,2,3-trisubstituted indole NPY Y-1 antagonists. J Med Chem 40:3712-4 (1997)  
Target
Name:
Neuropeptide Y receptor type 2
Synonyms:
NPY-Y2 NPY2-R NPY2R_HUMAN Y2 receptor | neuropeptide Y receptor Y2
Type:
Enzyme Catalytic Domain
Mol. Mass.:
42734.65
Organism:
Homo sapiens (Human)
Description:
NPY-Y2 NPY2R HUMAN::P49146
Residue:
381
  
Inhibitor
Name:
BDBM50060727
Synonyms:
2-(4-Chloro-phenoxymethyl)-1-methyl-3-piperidin-1-ylmethyl-1H-indole | CHEMBL421549
Type:
Small organic molecule
Emp. Form.:
C22H25ClN2O
Mol. Mass.:
368.9
SMILES:
Cn1c(COc2ccc(Cl)cc2)c(CN2CCCCC2)c2ccccc12
: