Target
Neuropeptide Y receptor type 4
Ligand
BDBM50060724
Substrate
Meas. Tech.
ChEMBL_143981 (CHEMBL752581)
Ki
>10000±n/a nM
Citation
 Hipskind, PALobb, KLNixon, JABritton, TCBruns, RFCatlow, JDieckman-McGinty, DKGackenheimer, SLGitter, BDIyengar, SSchober, DASimmons, RMSwanson, SZarrinmayeh, HZimmerman, DMGehlert, DR Potent and selective 1,2,3-trisubstituted indole NPY Y-1 antagonists. J Med Chem 40:3712-4 (1997)  
Target
Name:
Neuropeptide Y receptor type 4
Synonyms:
NPY-Y4 NPY4R PP1 Pancreatic polypeptide receptor 1
Type:
Enzyme Catalytic Domain
Mol. Mass.:
42207.58
Organism:
Homo sapiens (Human)
Description:
NPY-Y4 PPYR1 HUMAN::P50391
Residue:
375
  
Inhibitor
Name:
BDBM50060724
Synonyms:
2-[1,4']Bipiperidinyl-1'-yl-1-[2-(4-chloro-phenoxymethyl)-1-(2-piperidin-4-yl-ethyl)-1H-indol-3-yl]-ethanone | CHEMBL340369
Type:
Small organic molecule
Emp. Form.:
C34H45ClN4O2
Mol. Mass.:
577.2
SMILES:
Clc1ccc(OCc2c(C(=O)CN3CCC(CC3)N3CCCCC3)c3ccccc3n2CCC2CCNCC2)cc1
: