Target
Neuropeptide Y receptor type 4
Ligand
BDBM50060727
Substrate
Meas. Tech.
ChEMBL_143981 (CHEMBL752581)
Ki
>10000±n/a nM
Citation
 Hipskind, PALobb, KLNixon, JABritton, TCBruns, RFCatlow, JDieckman-McGinty, DKGackenheimer, SLGitter, BDIyengar, SSchober, DASimmons, RMSwanson, SZarrinmayeh, HZimmerman, DMGehlert, DR Potent and selective 1,2,3-trisubstituted indole NPY Y-1 antagonists. J Med Chem 40:3712-4 (1997)  
Target
Name:
Neuropeptide Y receptor type 4
Synonyms:
NPY-Y4 NPY4R PP1 Pancreatic polypeptide receptor 1
Type:
Enzyme Catalytic Domain
Mol. Mass.:
42207.58
Organism:
Homo sapiens (Human)
Description:
NPY-Y4 PPYR1 HUMAN::P50391
Residue:
375
  
Inhibitor
Name:
BDBM50060727
Synonyms:
2-(4-Chloro-phenoxymethyl)-1-methyl-3-piperidin-1-ylmethyl-1H-indole | CHEMBL421549
Type:
Small organic molecule
Emp. Form.:
C22H25ClN2O
Mol. Mass.:
368.9
SMILES:
Cn1c(COc2ccc(Cl)cc2)c(CN2CCCCC2)c2ccccc12
: