Target
Regulatory protein E2
Ligand
BDBM50060966
Substrate
Meas. Tech.
ChEMBL_81576 (CHEMBL689336)
Kd
9100000±n/a nM
Citation
 Hajduk, PJDinges, JMiknis, GFMerlock, MMiddleton, TKempf, DJEgan, DAWalter, KARobins, TSShuker, SBHolzman, TFFesik, SW NMR-based discovery of lead inhibitors that block DNA binding of the human papillomavirus E2 protein. J Med Chem 40:3144-50 (1997)  
Target
Name:
Regulatory protein E2
Synonyms:
E2 VE2_HPV16
Type:
PROTEIN
Mol. Mass.:
41834.37
Organism:
Human papillomavirus type 16
Description:
ChEMBL_532980
Residue:
365
  
Inhibitor
Name:
BDBM50060966
Synonyms:
4-Phenoxy-benzoic acid US10322118, Entry 11
Type:
Small organic molecule
Emp. Form.:
C13H10O3
Mol. Mass.:
214.2167
SMILES:
OC(=O)c1ccc(Oc2ccccc2)cc1
: