Target
Neutrophil elastase
Ligand
BDBM50061031
Substrate
Meas. Tech.
ChEMBL_63839 (CHEMBL674889)
Ki
0.06±n/a nM
Citation
 Veale, CABernstein, PRBohnert, CMBrown, FJBryant, CDamewood, JREarley, RFeeney, SWEdwards, PDGomes, BHulsizer, JMKosmider, BJKrell, RDMoore, GSalcedo, TWShaw, ASilberstein, DSSteelman, GBStein, MStrimpler, AThomas, RMVacek, EPWilliams, JCWolanin, DJWoolson, S Orally active trifluoromethyl ketone inhibitors of human leukocyte elastase. J Med Chem 40:3173-81 (1997)  
Target
Name:
Neutrophil elastase
Synonyms:
Bone marrow serine protease Coagulation factor X ELANE Elastase HLE Leukocyte elastase Medullasin Neutrophil elastase (HNE) PMN elastase Trypsin
Type:
Enzyme
Mol. Mass.:
28532.38
Organism:
Homo sapiens (Human)
Description:
P08246
Residue:
267
  
Inhibitor
Name:
BDBM50061031
Synonyms:
(S)-1-[(S)-2-(4-Benzenesulfonylaminocarbonyl-benzoylamino)-3-methyl-butyryl]-pyrrolidine-2-carboxylic acid ((S)-3,3-difluoro-1-isopropyl-2-oxo-3-phenethylcarbamoyl-propyl)-amide | CHEMBL320942
Type:
Small organic molecule
Emp. Form.:
C39H45F2N5O8S
Mol. Mass.:
781.865
SMILES:
CC(C)[C@H](NC(=O)c1ccc(cc1)C(=O)NS(=O)(=O)c1ccccc1)C(=O)N1CCC[C@H]1C(=O)N[C@@H](C(C)C)C(=O)C(F)(F)C(=O)NCCc1ccccc1
: