Target
Neutrophil elastase
Ligand
BDBM50061040
Substrate
Meas. Tech.
ChEMBL_63839 (CHEMBL674889)
Ki
1.9±n/a nM
Citation
 Veale, CABernstein, PRBohnert, CMBrown, FJBryant, CDamewood, JREarley, RFeeney, SWEdwards, PDGomes, BHulsizer, JMKosmider, BJKrell, RDMoore, GSalcedo, TWShaw, ASilberstein, DSSteelman, GBStein, MStrimpler, AThomas, RMVacek, EPWilliams, JCWolanin, DJWoolson, S Orally active trifluoromethyl ketone inhibitors of human leukocyte elastase. J Med Chem 40:3173-81 (1997)  
Target
Name:
Neutrophil elastase
Synonyms:
Bone marrow serine protease Coagulation factor X ELANE Elastase HLE Leukocyte elastase Medullasin Neutrophil elastase (HNE) PMN elastase Trypsin
Type:
Enzyme
Mol. Mass.:
28532.38
Organism:
Homo sapiens (Human)
Description:
P08246
Residue:
267
  
Inhibitor
Name:
BDBM50061040
Synonyms:
CHEMBL2370419 | {(S)-2-Methyl-1-[(S)-2-(3,3,3-trifluoro-1-isopropyl-2-oxo-propylcarbamoyl)-pyrrolidine-1-carbonyl]-propyl}-carbamic acid cyclopentyl ester
Type:
Small organic molecule
Emp. Form.:
C22H34F3N3O5
Mol. Mass.:
477.5177
SMILES:
CC(C)[C@H](NC(=O)OC1CCCC1)C(=O)N1CCC[C@H]1C(=O)N[C@@H](C(C)C)C(=O)C(F)(F)F
: