Target
Neutrophil elastase
Ligand
BDBM50061047
Substrate
Meas. Tech.
ChEMBL_63839 (CHEMBL674889)
Ki
0.35±n/a nM
Citation
 Veale, CABernstein, PRBohnert, CMBrown, FJBryant, CDamewood, JREarley, RFeeney, SWEdwards, PDGomes, BHulsizer, JMKosmider, BJKrell, RDMoore, GSalcedo, TWShaw, ASilberstein, DSSteelman, GBStein, MStrimpler, AThomas, RMVacek, EPWilliams, JCWolanin, DJWoolson, S Orally active trifluoromethyl ketone inhibitors of human leukocyte elastase. J Med Chem 40:3173-81 (1997)  
Target
Name:
Neutrophil elastase
Synonyms:
Bone marrow serine protease Coagulation factor X ELANE Elastase HLE Leukocyte elastase Medullasin Neutrophil elastase (HNE) PMN elastase Trypsin
Type:
Enzyme
Mol. Mass.:
28532.38
Organism:
Homo sapiens (Human)
Description:
P08246
Residue:
267
  
Inhibitor
Name:
BDBM50061047
Synonyms:
((S)-2,2-Difluoro-5-methyl-4-{[(S)-1-((S)-3-methyl-2-phenoxycarbonylamino-butyryl)-pyrrolidine-2-carbonyl]-amino}-3-oxo-hexyl)-carbamic acid butyl ester | CHEMBL108477
Type:
Small organic molecule
Emp. Form.:
C29H42F2N4O7
Mol. Mass.:
596.6632
SMILES:
CCCCOC(=O)NCC(F)(F)C(=O)[C@@H](NC(=O)[C@@H]1CCCN1C(=O)[C@@H](NC(=O)Oc1ccccc1)C(C)C)C(C)C
: