Target
5-hydroxytryptamine receptor 1B
Ligand
BDBM50061299
Substrate
Meas. Tech.
ChEMBL_1358 (CHEMBL616431)
Ki
0.300000±n/a nM
Citation
 Jorand-Lebrun, CPauwels, PJPalmier, CMoret, CChopin, PPerez, MMarien, MHalazy, S 5-HT1B receptor antagonist properties of novel arylpiperazide derivatives of 1-naphthylpiperazine. J Med Chem 40:3974-8 (1998)  
Target
Name:
5-hydroxytryptamine receptor 1B
Synonyms:
5-HT-1B 5-HT1B 5HT1B_HUMAN HTR1DB Serotonin (5-HT) receptor Serotonin Receptor 1B
Type:
G Protein-Coupled Receptor (GPCR)
Mol. Mass.:
43579.17
Organism:
Homo sapiens (Human)
Description:
Receptor binding assays were performed using human clone stably expressed in CHO cells
Residue:
390
  
Inhibitor
Name:
BDBM50061299
Synonyms:
2-[8-(4-Methyl-piperazin-1-yl)-naphthalen-2-yloxy]-1-(4-o-tolyl-piperazin-1-yl)-ethanone | CHEMBL340786
Type:
Small organic molecule
Emp. Form.:
C28H34N4O2
Mol. Mass.:
458.5952
SMILES:
CN1CCN(CC1)c1cccc2ccc(OCC(=O)N3CCN(CC3)c3ccccc3C)cc12
: