Target
Genome polyprotein
Ligand
BDBM50061522
Substrate
Meas. Tech.
ChEMBL_158975 (CHEMBL763742)
IC50
3000±n/a nM
Citation
 Ogilvie, WBailey, MPoupart, MAAbraham, ABhavsar, ABonneau, PBordeleau, JBousquet, YChabot, CDuceppe, JSFazal, GGoulet, SGrand-Maître, CGuse, IHalmos, TLavallée, PLeach, MMalenfant, EO'Meara, JPlante, RPlouffe, CPoirier, MSoucy, FYoakim, CDéziel, R Peptidomimetic inhibitors of the human cytomegalovirus protease. J Med Chem 40:4113-35 (1998)  
Target
Name:
Genome polyprotein
Synonyms:
Human rhinovirus A protease | Human rhinovirus B 3A protease
Type:
PROTEIN
Mol. Mass.:
44361.04
Organism:
Human rhinovirus B
Description:
ChEMBL_158953
Residue:
401
  
Inhibitor
Name:
BDBM50061522
Synonyms:
(S)-2-[(S)-2-((S)-2-Acetylamino-3-methyl-butyrylamino)-3-methyl-butyrylamino]-N*1*-(3,3,3-trifluoro-1-methyl-2-oxo-propyl)-succinamide | CHEMBL422084
Type:
Small organic molecule
Emp. Form.:
C20H32F3N5O6
Mol. Mass.:
495.4932
SMILES:
CC(C)[C@H](NC(C)=O)C(=O)N[C@@H](C(C)C)C(=O)N[C@@H](CC(N)=O)C(=O)NC(C)C(=O)C(F)(F)F
: