Target
Genome polyprotein
Ligand
BDBM50061553
Substrate
Meas. Tech.
ChEMBL_158975 (CHEMBL763742)
IC50
1100±n/a nM
Citation
 Ogilvie, WBailey, MPoupart, MAAbraham, ABhavsar, ABonneau, PBordeleau, JBousquet, YChabot, CDuceppe, JSFazal, GGoulet, SGrand-Maître, CGuse, IHalmos, TLavallée, PLeach, MMalenfant, EO'Meara, JPlante, RPlouffe, CPoirier, MSoucy, FYoakim, CDéziel, R Peptidomimetic inhibitors of the human cytomegalovirus protease. J Med Chem 40:4113-35 (1998)  
Target
Name:
Genome polyprotein
Synonyms:
Human rhinovirus A protease | Human rhinovirus B 3A protease
Type:
PROTEIN
Mol. Mass.:
44361.04
Organism:
Human rhinovirus B
Description:
ChEMBL_158953
Residue:
401
  
Inhibitor
Name:
BDBM50061553
Synonyms:
(S)-2-[(S)-2-(3,3-Dimethyl-butyrylamino)-3,3-dimethyl-butyrylamino]-N*4*,N*4*-dimethyl-N*1*-(1-methyl-2-methylcarbamoyl-2-oxo-ethyl)-succinamide | CHEMBL335061
Type:
Small organic molecule
Emp. Form.:
C23H41N5O6
Mol. Mass.:
483.6015
SMILES:
CNC(=O)C(=O)C(C)NC(=O)[C@H](CC(=O)N(C)C)NC(=O)[C@@H](NC(=O)CC(C)(C)C)C(C)(C)C
: