Target
Chymotrypsinogen A
Ligand
BDBM50061504
Substrate
Meas. Tech.
ChEMBL_33820 (CHEMBL646850)
IC50
>75000±n/a nM
Citation
 Ogilvie, WBailey, MPoupart, MAAbraham, ABhavsar, ABonneau, PBordeleau, JBousquet, YChabot, CDuceppe, JSFazal, GGoulet, SGrand-Maître, CGuse, IHalmos, TLavallée, PLeach, MMalenfant, EO'Meara, JPlante, RPlouffe, CPoirier, MSoucy, FYoakim, CDéziel, R Peptidomimetic inhibitors of the human cytomegalovirus protease. J Med Chem 40:4113-35 (1998)  
Target
Name:
Chymotrypsinogen A
Synonyms:
Alpha-chymotrypsin Chymotrypsin A Chymotrypsin A chain B Chymotrypsinogen A | alpha-Chymotrypsin (α-Chymotrypsin)
Type:
Serine protease
Mol. Mass.:
25670.88
Organism:
Bos taurus (bovine)
Description:
Residue:
245
  
Inhibitor
Name:
BDBM50061504
Synonyms:
(S)-N*1*-((S)-1-Benzyloxy-2-oxo-azetidin-3-yl)-2-[(S)-2-(3,3-dimethyl-butyrylamino)-3,3-dimethyl-butyrylamino]-N*4*,N*4*-dimethyl-succinamide | CHEMBL131760
Type:
Small organic molecule
Emp. Form.:
C28H43N5O6
Mol. Mass.:
545.6709
SMILES:
CN(C)C(=O)C[C@H](NC(=O)[C@@H](NC(=O)CC(C)(C)C)C(C)(C)C)C(=O)N[C@H]1CN(OCc2ccccc2)C1=O
: