Target
Retinoic acid receptor RXR-beta
Ligand
BDBM50061617
Substrate
Meas. Tech.
ChEMBL_196507 (CHEMBL798321)
Ki
1200±n/a nM
Citation
 Umemiya, HFukasawa, HEbisawa, MEyrolles, LKawachi, EEisenmann, GGronemeyer, HHashimoto, YShudo, KKagechika, H Regulation of retinoidal actions by diazepinylbenzoic acids. Retinoid synergists which activate the RXR-RAR heterodimers. J Med Chem 40:4222-34 (1998)  
Target
Name:
Retinoic acid receptor RXR-beta
Synonyms:
NR2B2 RXRB Retinoic acid receptor RXR-beta Retinoid receptor
Type:
PROTEIN
Mol. Mass.:
56932.89
Organism:
Homo sapiens (Human)
Description:
ChEMBL_39045
Residue:
533
  
Inhibitor
Name:
BDBM50061617
Synonyms:
4-(7,7,10,10-Tetramethyl-7,8,9,10-tetrahydro-5-oxa-13-aza-benzo[4,5]cyclohepta[1,2-b]naphthalen-12-yl)-benzoic acid | CHEMBL334534
Type:
Small organic molecule
Emp. Form.:
C28H27NO3
Mol. Mass.:
425.5189
SMILES:
CC1(C)CCC(C)(C)c2cc3c(Oc4ccccc4N=C3c3ccc(cc3)C(O)=O)cc12
: