Target
Reverse transcriptase/RNaseH
Ligand
BDBM50004124
Substrate
Meas. Tech.
ChEMBL_197283 (CHEMBL804270)
EC50
5.9±n/a nM
Citation
 Kireev, DBChrétien, JRGrierson, DSMonneret, C A 3D QSAR study of a series of HEPT analogues: the influence of conformational mobility on HIV-1 reverse transcriptase inhibition. J Med Chem 40:4257-64 (1998)  
Target
Name:
Reverse transcriptase/RNaseH
Synonyms:
HIV-1 Reverse Transcriptase RNase H Reverse transcriptase/RNaseH
Type:
PROTEIN
Mol. Mass.:
65229.15
Organism:
Human immunodeficiency virus 1
Description:
ChEMBL_1473730
Residue:
566
  
Inhibitor
Name:
BDBM50004124
Synonyms:
1-Benzyloxymethyl-5-ethyl-6-phenylsulfanyl-1H-pyrimidine-2,4-dione | CHEMBL288688
Type:
Small organic molecule
Emp. Form.:
C20H20N2O3S
Mol. Mass.:
368.449
SMILES:
CCc1c(Sc2ccccc2)n(COCc2ccccc2)c(=O)[nH]c1=O
: