Target
Platelet-activating factor receptor
Ligand
BDBM50062083
Substrate
Meas. Tech.
ChEMBL_158347 (CHEMBL768491)
Ki
39±n/a nM
Citation
 Curtin, MLDavidsen, SKHeyman, HRGarland, RBSheppard, GSFlorjancic, ASXu, LCarrera, GMSteinman, DHTrautmann, JAAlbert, DHMagoc, TJTapang, PRhein, DAConway, RGLuo, GDenissen, JFMarsh, KCMorgan, DWSummers, JB Discovery and evaluation of a series of 3-acylindole imidazopyridine platelet-activating factor antagonists. J Med Chem 41:74-95 (1998)  
Target
Name:
Platelet-activating factor receptor
Synonyms:
PAF-R PTAFR_CAVPO Platelet-activating factor receptor
Type:
Protein
Mol. Mass.:
39005.63
Organism:
Cavia porcellus
Description:
Residue:
342
  
Inhibitor
Name:
BDBM50062083
Synonyms:
6-(4-Fluoro-phenyl)-3-[4-(2-methyl-imidazo[4,5-c]pyridin-1-ylmethyl)-thiazole-2-carbonyl]-indole-1-carboxylic acid dimethylamide | CHEMBL173318
Type:
Small organic molecule
Emp. Form.:
C29H23FN6O2S
Mol. Mass.:
538.595
SMILES:
CN(C)C(=O)n1cc(C(=O)c2nc(Cn3c(C)nc4cnccc34)cs2)c2ccc(cc12)-c1ccc(F)cc1
: