Target
Platelet-activating factor receptor
Ligand
BDBM50062120
Substrate
Meas. Tech.
ChEMBL_158347 (CHEMBL768491)
Ki
13±n/a nM
Citation
 Curtin, MLDavidsen, SKHeyman, HRGarland, RBSheppard, GSFlorjancic, ASXu, LCarrera, GMSteinman, DHTrautmann, JAAlbert, DHMagoc, TJTapang, PRhein, DAConway, RGLuo, GDenissen, JFMarsh, KCMorgan, DWSummers, JB Discovery and evaluation of a series of 3-acylindole imidazopyridine platelet-activating factor antagonists. J Med Chem 41:74-95 (1998)  
Target
Name:
Platelet-activating factor receptor
Synonyms:
PAF-R PTAFR_CAVPO Platelet-activating factor receptor
Type:
Protein
Mol. Mass.:
39005.63
Organism:
Cavia porcellus
Description:
Residue:
342
  
Inhibitor
Name:
BDBM50062120
Synonyms:
1-Dimethylcarbamoyl-3-[4-(2-methyl-imidazo[4,5-c]pyridin-1-ylmethyl)-benzenesulfonyl]-1H-indole-4-carboxylic acid methyl ester | CHEMBL174192
Type:
Small organic molecule
Emp. Form.:
C27H25N5O5S
Mol. Mass.:
531.583
SMILES:
COC(=O)c1cccc2n(cc(c12)S(=O)(=O)c1ccc(Cn2c(C)nc3cnccc23)cc1)C(=O)N(C)C
: