Target
Platelet-activating factor receptor
Ligand
BDBM50062104
Substrate
Meas. Tech.
ChEMBL_158347 (CHEMBL768491)
Ki
5±n/a nM
Citation
 Curtin, MLDavidsen, SKHeyman, HRGarland, RBSheppard, GSFlorjancic, ASXu, LCarrera, GMSteinman, DHTrautmann, JAAlbert, DHMagoc, TJTapang, PRhein, DAConway, RGLuo, GDenissen, JFMarsh, KCMorgan, DWSummers, JB Discovery and evaluation of a series of 3-acylindole imidazopyridine platelet-activating factor antagonists. J Med Chem 41:74-95 (1998)  
Target
Name:
Platelet-activating factor receptor
Synonyms:
PAF-R PTAFR_CAVPO Platelet-activating factor receptor
Type:
Protein
Mol. Mass.:
39005.63
Organism:
Cavia porcellus
Description:
Residue:
342
  
Inhibitor
Name:
BDBM50062104
Synonyms:
1-Dimethylcarbamoyl-3-[3-fluoro-4-(2-methyl-imidazo[4,5-c]pyridin-1-ylmethyl)-benzoyl]-1H-indole-4-carboxylic acid methyl ester | CHEMBL367393
Type:
Small organic molecule
Emp. Form.:
C28H24FN5O4
Mol. Mass.:
513.5197
SMILES:
COC(=O)c1cccc2n(cc(C(=O)c3ccc(Cn4c(C)nc5cnccc45)c(F)c3)c12)C(=O)N(C)C
: