Target
Matrix metalloproteinase-9
Ligand
BDBM50062302
Substrate
Meas. Tech.
ChEMBL_105401 (CHEMBL710820)
Ki
0.900000±n/a nM
Citation
 Levy, DELapierre, FLiang, WYe, WLange, CWLi, XGrobelny, DCasabonne, MTyrrell, DHolme, KNadzan, AGalardy, RE Matrix metalloproteinase inhibitors: a structure-activity study. J Med Chem 41:199-223 (1998)  
Target
Name:
Matrix metalloproteinase-9
Synonyms:
67 kDa matrix metalloproteinase-9 92 kDa gelatinase CLG4B Gelatinase B MMP9 Matrix metalloproteinase 9 (MMP-9) Matrix metalloproteinase-9 (MMP9)
Type:
Enzyme
Mol. Mass.:
78452.28
Organism:
Homo sapiens (Human)
Description:
P14780
Residue:
707
  
Inhibitor
Name:
BDBM50062302
Synonyms:
(R)-N*4*-Hydroxy-N*1*-{(S)-2-(1H-indol-3-yl)-1-[(thiazol-2-ylmethyl)-carbamoyl]-ethyl}-2-isobutyl-succinamide | CHEMBL71995
Type:
Small organic molecule
Emp. Form.:
C23H29N5O4S
Mol. Mass.:
471.572
SMILES:
CC(C)C[C@H](CC(=O)NO)C(=O)N[C@@H](Cc1c[nH]c2ccccc12)C(=O)NCc1nccs1
: