Target
Neutrophil collagenase
Ligand
BDBM50062340
Substrate
Meas. Tech.
ChEMBL_105205 (CHEMBL713844)
Ki
0.66±n/a nM
Citation
 Levy, DELapierre, FLiang, WYe, WLange, CWLi, XGrobelny, DCasabonne, MTyrrell, DHolme, KNadzan, AGalardy, RE Matrix metalloproteinase inhibitors: a structure-activity study. J Med Chem 41:199-223 (1998)  
Target
Name:
Neutrophil collagenase
Synonyms:
CLG1 MMP8 Matrix metalloproteinase-8 PMNL collagenase | PMNL-CL
Type:
Enzyme
Mol. Mass.:
53413.48
Organism:
Homo sapiens (Human)
Description:
P22894
Residue:
467
  
Inhibitor
Name:
BDBM50062340
Synonyms:
(R)-N*4*-Hydroxy-2-isobutyl-N*1*-[(S)-1-methylcarbamoyl-2-(1-methyl-1H-indol-3-yl)-ethyl]-succinamide | CHEMBL72678
Type:
Small organic molecule
Emp. Form.:
C21H30N4O4
Mol. Mass.:
402.4873
SMILES:
CNC(=O)[C@H](Cc1cn(C)c2ccccc12)NC(=O)[C@H](CC(C)C)CC(=O)NO
: