Target
Neutrophil collagenase
Ligand
BDBM50062347
Substrate
Meas. Tech.
ChEMBL_105205 (CHEMBL713844)
Ki
0.94±n/a nM
Citation
 Levy, DELapierre, FLiang, WYe, WLange, CWLi, XGrobelny, DCasabonne, MTyrrell, DHolme, KNadzan, AGalardy, RE Matrix metalloproteinase inhibitors: a structure-activity study. J Med Chem 41:199-223 (1998)  
Target
Name:
Neutrophil collagenase
Synonyms:
CLG1 MMP8 Matrix metalloproteinase-8 PMNL collagenase | PMNL-CL
Type:
Enzyme
Mol. Mass.:
53413.48
Organism:
Homo sapiens (Human)
Description:
P22894
Residue:
467
  
Inhibitor
Name:
BDBM50062347
Synonyms:
CHEMBL74182 | {2-[(S)-2-((R)-2-Hydroxycarbamoylmethyl-4-methyl-pentanoylamino)-3-(1H-indol-3-yl)-propionylamino]-ethyl}-carbamic acid benzyl ester
Type:
Small organic molecule
Emp. Form.:
C29H37N5O6
Mol. Mass.:
551.634
SMILES:
CC(C)C[C@H](CC(=O)NO)C(=O)N[C@@H](Cc1c[nH]c2ccccc12)C(=O)NCCNC(=O)OCc1ccccc1
: