Target
Metabotropic glutamate receptor 3
Ligand
BDBM50062495
Substrate
Meas. Tech.
ChEMBL_106379 (CHEMBL718352)
IC50
1800±n/a nM
Citation
 Ornstein, PLBleisch, TJArnold, MBWright, RAJohnson, BGSchoepp, DD 2-Substituted (2SR)-2-amino-2-((1SR,2SR)-2-carboxycycloprop-1-yl)glycines as potent and selective antagonists of group II metabotropic glutamate receptors. 1. Effects of alkyl, arylalkyl, and diarylalkyl substitution. J Med Chem 41:346-57 (1998)  
Target
Name:
Metabotropic glutamate receptor 3
Synonyms:
GPRC1C GRM3_HUMAN metabotropic glutamate 3 metabotropic glutamate 3/1c
Type:
Enzyme Catalytic Domain
Mol. Mass.:
98889.09
Organism:
Homo sapiens (Human)
Description:
metabotropic glutamate 1c 0 HUMAN::Q14832
Residue:
879
  
Inhibitor
Name:
BDBM50062495
Synonyms:
(S)-2-((R)-1-Amino-1-carboxy-3-methyl-butyl)-cyclopropanecarboxylic acid | CHEMBL331753
Type:
Small organic molecule
Emp. Form.:
C10H17NO4
Mol. Mass.:
215.2463
SMILES:
CC(C)C[C@@](N)(C1C[C@@H]1C(O)=O)C(O)=O
: