Target
Metabotropic glutamate receptor 2
Ligand
BDBM50062529
Substrate
Meas. Tech.
ChEMBL_106035 (CHEMBL717203)
IC50
1000±n/a nM
Citation
 Ornstein, PLBleisch, TJArnold, MBKennedy, JHWright, RAJohnson, BGTizzano, JPHelton, DRKallman, MJSchoepp, DDHérin, M 2-substituted (2SR)-2-amino-2-((1SR,2SR)-2-carboxycycloprop-1-yl)glycines as potent and selective antagonists of group II metabotropic glutamate receptors. 2. Effects of aromatic substitution, pharmacological characterization, and bioavailability. J Med Chem 41:358-78 (1998)  
Target
Name:
Metabotropic glutamate receptor 2
Synonyms:
GPRC1B GRM2_HUMAN Metabotropic glutamate receptor mGlu2 | metabotropic glutamate 2
Type:
Enzyme
Mol. Mass.:
95584.88
Organism:
Homo sapiens (Human)
Description:
Q14416
Residue:
872
  
Inhibitor
Name:
BDBM50062529
Synonyms:
(S)-2-[(R)-1-Amino-1-carboxy-3-(3-hydroxy-phenyl)-propyl]-cyclopropanecarboxylic acid | CHEMBL124483
Type:
Small organic molecule
Emp. Form.:
C14H17NO5
Mol. Mass.:
279.2885
SMILES:
N[C@](CCc1cccc(O)c1)(C1C[C@@H]1C(O)=O)C(O)=O
: