Target
Muscarinic acetylcholine receptor M1
Ligand
BDBM50062577
Substrate
Meas. Tech.
ChEMBL_139210 (CHEMBL745685)
EC50
1±n/a nM
Citation
 Ward, JSMerritt, LCalligaro, DOBymaster, FPShannon, HEMitch, CHWhitesitt, CBrunsting, DSheardown, MJOlesen, PHSwedberg, MDJeppesen, LSauerberg, P 1,2,5-Thiadiazole analogues of aceclidine as potent m1 muscarinic agonists. J Med Chem 41:379-92 (1998)  
Target
Name:
Muscarinic acetylcholine receptor M1
Synonyms:
ACM1_HUMAN Cholinergic receptor, muscarinic 1 | Cholinergic, muscarinic M1
Type:
Protein
Mol. Mass.:
51442.54
Organism:
Homo sapiens (Human)
Description:
P11229
Residue:
460
  
Inhibitor
Name:
BDBM50062577
Synonyms:
6-(4-Propylsulfanyl-[1,2,5]thiadiazol-3-yloxy)-1-aza-bicyclo[3.2.1]octane | CHEMBL340435
Type:
Small organic molecule
Emp. Form.:
C12H19N3OS2
Mol. Mass.:
285.429
SMILES:
CCCSc1nsnc1OC1CN2CC1CCC2
: