Target
Cyclic AMP-dependent transcription factor ATF-1
Ligand
BDBM50062649
Substrate
Meas. Tech.
ChEMBL_27877 (CHEMBL640575)
IC50
2700±n/a nM
Citation
 Sullivan, RWBigam, CGErdman, PEPalanki, MSAnderson, DWGoldman, MERansone, LJSuto, MJ 2-Chloro-4-(trifluoromethyl)pyrimidine-5-N-(3',5'- bis(trifluoromethyl)phenyl)-carboxamide: a potent inhibitor of NF-kappa B- and AP-1-mediated gene expression identified using solution-phase combinatorial chemistry. J Med Chem 41:413-9 (1998)  
Target
Name:
Cyclic AMP-dependent transcription factor ATF-1
Synonyms:
ATF1 Activating transcription factor 1 Protein TREB36 | cAMP-dependent transcription factor ATF-1
Type:
PROTEIN
Mol. Mass.:
29236.24
Organism:
Homo sapiens (Human)
Description:
ChEMBL_27877
Residue:
271
  
Inhibitor
Name:
BDBM50062649
Synonyms:
2-Chloro-4-trifluoromethyl-pyrimidine-5-carboxylic acid benzyl-(3,5-dichloro-phenyl)-amide | CHEMBL131622
Type:
Small organic molecule
Emp. Form.:
C19H11Cl3F3N3O
Mol. Mass.:
460.664
SMILES:
FC(F)(F)c1nc(Cl)ncc1C(=O)N(Cc1ccccc1)c1cc(Cl)cc(Cl)c1
: