Target
Coagulation factor X
Ligand
BDBM50062695
Substrate
Meas. Tech.
ChEMBL_48636 (CHEMBL874700)
IC50
540±n/a nM
Citation
 Klein, SICzekaj, MGardner, CJGuertin, KRCheney, DLSpada, APBolton, SABrown, KColussi, DHeran, CLMorgan, SRLeadley, RJDunwiddie, CTPerrone, MHChu, V Identification and initial structure-activity relationships of a novel class of nonpeptide inhibitors of blood coagulation factor Xa. J Med Chem 41:437-50 (1998)  
Target
Name:
Coagulation factor X
Synonyms:
Activated coagulation factor X (FXa) Coagulation factor X precursor F10 Factor X heavy chain Factor Xa Stuart-Prower factor
Type:
Enzyme
Mol. Mass.:
54726.60
Organism:
Homo sapiens (Human)
Description:
Residue:
488
  
Inhibitor
Name:
BDBM50062695
Synonyms:
Biphenyl-4-carboxylic acid {(E)-1-[2-(3-carbamimidoyl-phenyl)-1-methoxymethyl-ethyl]-3-phenyl-allyl}-amide | CHEMBL422819
Type:
Small organic molecule
Emp. Form.:
C33H33N3O2
Mol. Mass.:
503.634
SMILES:
COCC(Cc1cccc(c1)C(N)=N)C(NC(=O)c1ccc(cc1)-c1ccccc1)\C=C\c1ccccc1
: