Target
Serine protease 1/Trypsin-2
Ligand
BDBM50062698
Substrate
Meas. Tech.
ChEMBL_212349 (CHEMBL816796)
IC50
1800±n/a nM
Citation
 Klein, SICzekaj, MGardner, CJGuertin, KRCheney, DLSpada, APBolton, SABrown, KColussi, DHeran, CLMorgan, SRLeadley, RJDunwiddie, CTPerrone, MHChu, V Identification and initial structure-activity relationships of a novel class of nonpeptide inhibitors of blood coagulation factor Xa. J Med Chem 41:437-50 (1998)  
Target
Name:
Serine protease 1/Trypsin-2
Synonyms:
Trypsin II
Type:
Mol. Mass.:
Description:
ASSAY_ID of EBI is 212335
Components:
This complex has 2 components.
Component 1
Name:
Serine protease 1
Synonyms:
Alpha-trypsin chain 1 Beta-trypsin PRSS1 TRP1 TRY1_HUMAN Thrombin & trypsin Trypsin I | Trypsin-1
Type:
Enzyme
Mol. Mass.:
26557.80
Organism:
Homo sapiens (Human)
Description:
P07477
Residue:
247
  
Component 2
Name:
Trypsin-2
Synonyms:
Anionic trypsinogen Serine protease 2 TRY2_HUMAN Thrombin & trypsin Trypsin II | Trypsin-2
Type:
PROTEIN
Mol. Mass.:
26479.43
Organism:
Homo sapiens (Human)
Description:
ChEMBL_41517
Residue:
247
  
Inhibitor
Name:
BDBM50062698
Synonyms:
(E)-2-(3-Carbamimidoyl-benzyl)-3-[(2'-methoxy-biphenyl-4-carbonyl)-amino]-5-phenyl-pent-4-enoic acid methyl ester | CHEMBL138258
Type:
Small organic molecule
Emp. Form.:
C34H33N3O4
Mol. Mass.:
547.6435
SMILES:
COC(=O)C(Cc1cccc(c1)C(N)=N)C(NC(=O)c1ccc(cc1)-c1ccccc1OC)\C=C\c1ccccc1
: