Target
Prothrombin
Ligand
BDBM50062700
Substrate
Meas. Tech.
ChEMBL_207992 (CHEMBL816075)
IC50
1700±n/a nM
Citation
 Klein, SICzekaj, MGardner, CJGuertin, KRCheney, DLSpada, APBolton, SABrown, KColussi, DHeran, CLMorgan, SRLeadley, RJDunwiddie, CTPerrone, MHChu, V Identification and initial structure-activity relationships of a novel class of nonpeptide inhibitors of blood coagulation factor Xa. J Med Chem 41:437-50 (1998)  
Target
Name:
Prothrombin
Synonyms:
Activation peptide fragment 1 Coagulation factor II Prothrombin precursor Thrombin heavy chain | Thrombin light chain
Type:
Protein
Mol. Mass.:
70029.57
Organism:
Homo sapiens (Human)
Description:
P00734
Residue:
622
  
Inhibitor
Name:
BDBM50062700
Synonyms:
(E)-2-(3-Carbamimidoyl-benzyl)-3-[(3'-ethyl-biphenyl-4-carbonyl)-amino]-5-phenyl-pent-4-enoic acid methyl ester | CHEMBL342211
Type:
Small organic molecule
Emp. Form.:
C35H35N3O3
Mol. Mass.:
545.6707
SMILES:
CCc1cccc(c1)-c1ccc(cc1)C(=O)NC(\C=C\c1ccccc1)C(Cc1cccc(c1)C(N)=N)C(=O)OC
: